{"text_format":"1","workbook":"xlsx","n_sheets":3,"sheets":["yatay","dikey","Makrolar_Etkinleşmemiş"],"not_rendered":{"charts":0,"images":3,"macros":1,"external_links":0,"defined_names":19,"comments":0,"pivot_tables":0},"unopened":[],"bounds":{"document_bytes":16777216,"sheet_cells":100000,"rows_first":2000,"rows_last":500,"rows_between":2000,"halvings":0,"cell_chars":16384,"cell_head_chars":4096},"cells_cut":0,"cells_raw":0,"read":"whole","date_system":"1900"}

{"sheet":"yatay","index":0,"n_rows":14,"n_cols":26,"rows_kept":14,"cut":false,"hidden":true,"merged":[]}
[null,null,1917034896,null,null,null,{"$f":"SUBTOTAL(9,G3:G14)","v":312066},{"$f":"SUBTOTAL(9,H3:H14)","v":312066},43689.239999999991,3120.72,0,265256.03999999992,1724164.2600000002,45151.19,1724164.2599999998,45151.19,0,0,0,0,265256.03999999992,64753.68,6241.3199999999988,383061,-15603.360000000002,367457.6399999999]
["Ay","SGK Tipi","Engel Derece","Zorunlu Bes","Maaş Tipi","Maaş","Brüt Maaş","SGK Matrahı","SGK Primi","İŞSİZLİK Primi","Engellilik İndirimi","Gelir Vergisi Matrahı","Kümülatif Gelir Vergisi Matrahı","Gelir Vergisi","Asgari Ücret Kümülatif Matrahı","Asgari Ücret Gelir Vergisi","Kesilecek Gelir Vergisi","Damga Vergisi Matrahı","Damga Vergisi","Otomatik Katılımlı BES","Net Hakediş","SGK İşveren","İŞSİZLİK İşveren","Maliyet","Hazine Yardımı","Maliyet %5 İndirimli"]
[1,"Normal",0,0,"BRÜT",26005.5,{"$f":"IF($E3=\"NET\",yuvarlama(BrutMaas($B3,$F3,$I3,$J3,$Q3,$S3,150018.75,IF(ISNUMBER($M2),$M2,0))),$F3)","v":26005.5},{"$f":"SGKMatrahi(G3,IF(A3<7,150018.9,150018.9))","v":26005.5},{"$f":"SGKPrimi(B3,H3)","v":3640.77},{"$f":"IssizlikPrimi(B3,H3)","v":260.06},{"$f":"EngelliIndirimi(C3)","v":0},{"$f":"GelirVergisiMatrahi(G3,I3,J3,K3)","v":22104.67},{"$f":"ROUND(L3+IF(ISNUMBER(M2),M2,0),2)","v":22104.67},{"$f":"ROUND(GelirVergisi(M3)-GelirVergisi(M3-L3),2)","v":3315.7},{"$f":"IF(G3<=0,IF(ISNUMBER(O2),O2,0),IF(ISNUMBER(O2),O2+IF(A3<7,22104.67,22104.67),IF(A3<7,22104.67,22104.67)))","v":22104.67},{"$f":"ROUND(GelirVergisi(O3)-GelirVergisi(O3-IF(G3<=0,IF(ISNUMBER(O2),O2,0),IF(ISNUMBER(O2),IF(A3<7,22104.67,22104.67),IF(A3<7,22104.67,22104.67)))),2)","v":3315.7},{"$f":"ROUND(IF(N3-P3<=0,0,N3-P3),2)","v":0},{"$f":"DamgaVergisiMatrahi(G3,A3)","v":0},{"$f":"DamgaVergisi(B3,R3)","v":0},{"$f":"ROUNDDOWN(IF(D3>0,H3*D3%,0),0)","v":0},{"$f":"G3-I3-J3-Q3-S3-T3","v":22104.67},{"$f":"SGKIsverenPrimi(B3,H3)","v":5396.14},{"$f":"IssizlikIsverenPrimi(B3,H3)","v":520.11},{"$f":"ROUND(G3+SUM(V3:W3),2)","v":31921.75},{"$f":"IF(OR(B3=\"Normal\",B3=\"EYT\"),-ROUND(H3*5%,2),0)","v":-1300.28},{"$f":"SUM(G3,V3:W3,Y3)","v":30621.47}]
[2,"Normal",0,0,"BRÜT",26005.5,{"$f":"IF($E4=\"NET\",yuvarlama(BrutMaas($B4,$F4,$I4,$J4,$Q4,$S4,150018.75,IF(ISNUMBER($M3),$M3,0))),$F4)","v":26005.5},{"$f":"SGKMatrahi(G4,IF(A4<7,150018.9,150018.9))","v":26005.5},{"$f":"SGKPrimi(B4,H4)","v":3640.77},{"$f":"IssizlikPrimi(B4,H4)","v":260.06},{"$f":"EngelliIndirimi(C4)","v":0},{"$f":"GelirVergisiMatrahi(G4,I4,J4,K4)","v":22104.67},{"$f":"ROUND(L4+IF(ISNUMBER(M3),M3,0),2)","v":44209.34},{"$f":"ROUND(GelirVergisi(M4)-GelirVergisi(M4-L4),2)","v":3315.7},44209.34,{"$f":"ROUND(GelirVergisi(O4)-GelirVergisi(O4-IF(G4<=0,IF(ISNUMBER(O3),O3,0),IF(ISNUMBER(O3),IF(A4<7,22104.67,22104.67),IF(A4<7,22104.67,22104.67)))),2)","v":3315.7},{"$f":"ROUND(IF(N4-P4<=0,0,N4-P4),2)","v":0},{"$f":"DamgaVergisiMatrahi(G4,A4)","v":0},{"$f":"DamgaVergisi(B4,R4)","v":0},{"$f":"ROUNDDOWN(IF(D4>0,H4*D4%,0),0)","v":0},{"$f":"G4-I4-J4-Q4-S4-T4","v":22104.67},{"$f":"SGKIsverenPrimi(B4,H4)","v":5396.14},{"$f":"IssizlikIsverenPrimi(B4,H4)","v":520.11},{"$f":"ROUND(G4+SUM(V4:W4),2)","v":31921.75},{"$f":"IF(OR(B4=\"Normal\",B4=\"EYT\"),-ROUND(H4*5%,2),0)","v":-1300.28},{"$f":"SUM(G4,V4:W4,Y4)","v":30621.47}]
[3,"Normal",0,0,"BRÜT",26005.5,{"$f":"IF($E5=\"NET\",yuvarlama(BrutMaas($B5,$F5,$I5,$J5,$Q5,$S5,150018.75,IF(ISNUMBER($M4),$M4,0))),$F5)","v":26005.5},26005.5,3640.77,260.06,0,22104.67,66314.009999999995,{"$f":"ROUND(GelirVergisi(M5)-GelirVergisi(M5-L5),2)","v":3315.7},66314.009999999995,{"$f":"ROUND(GelirVergisi(O5)-GelirVergisi(O5-IF(G5<=0,IF(ISNUMBER(O4),O4,0),IF(ISNUMBER(O4),IF(A5<7,22104.67,22104.67),IF(A5<7,22104.67,22104.67)))),2)","v":3315.7},0,0,0,0,22104.67,5396.14,520.11,31921.75,-1300.28,30621.47]
[4,"Normal",0,0,"BRÜT",26005.5,{"$f":"IF($E6=\"NET\",yuvarlama(BrutMaas($B6,$F6,$I6,$J6,$Q6,$S6,150018.75,IF(ISNUMBER($M5),$M5,0))),$F6)","v":26005.5},26005.5,3640.77,260.06,0,22104.67,88418.68,{"$f":"ROUND(GelirVergisi(M6)-GelirVergisi(M6-L6),2)","v":3315.7},88418.68,{"$f":"ROUND(GelirVergisi(O6)-GelirVergisi(O6-IF(G6<=0,IF(ISNUMBER(O5),O5,0),IF(ISNUMBER(O5),IF(A6<7,22104.67,22104.67),IF(A6<7,22104.67,22104.67)))),2)","v":3315.7},0,0,0,0,22104.67,5396.14,520.11,31921.75,-1300.28,30621.47]
[5,"Normal",0,0,"BRÜT",26005.5,{"$f":"IF($E7=\"NET\",yuvarlama(BrutMaas($B7,$F7,$I7,$J7,$Q7,$S7,150018.75,IF(ISNUMBER($M6),$M6,0))),$F7)","v":26005.5},26005.5,3640.77,260.06,0,22104.67,110523.35,{"$f":"ROUND(GelirVergisi(M7)-GelirVergisi(M7-L7),2)","v":3315.7},110523.34999999999,{"$f":"ROUND(GelirVergisi(O7)-GelirVergisi(O7-IF(G7<=0,IF(ISNUMBER(O6),O6,0),IF(ISNUMBER(O6),IF(A7<7,22104.67,22104.67),IF(A7<7,22104.67,22104.67)))),2)","v":3315.7},0,0,0,0,22104.67,5396.14,520.11,31921.75,-1300.28,30621.47]
[6,"Normal",0,0,"BRÜT",26005.5,{"$f":"IF($E8=\"NET\",yuvarlama(BrutMaas($B8,$F8,$I8,$J8,$Q8,$S8,150018.75,IF(ISNUMBER($M7),$M7,0))),$F8)","v":26005.5},26005.5,3640.77,260.06,0,22104.67,132628.01999999999,{"$f":"ROUND(GelirVergisi(M8)-GelirVergisi(M8-L8),2)","v":3315.7},132628.01999999999,{"$f":"ROUND(GelirVergisi(O8)-GelirVergisi(O8-IF(G8<=0,IF(ISNUMBER(O7),O7,0),IF(ISNUMBER(O7),IF(A8<7,22104.67,22104.67),IF(A8<7,22104.67,22104.67)))),2)","v":3315.7},0,0,0,0,22104.67,5396.14,520.11,31921.75,-1300.28,30621.47]
[7,"Normal",0,0,"BRÜT",26005.5,{"$f":"IF($E9=\"NET\",yuvarlama(BrutMaas($B9,$F9,$I9,$J9,$Q9,$S9,150018.75,IF(ISNUMBER($M8),$M8,0))),$F9)","v":26005.5},26005.5,3640.77,{"$f":"IssizlikPrimi(B9,H9)","v":260.06},0,22104.67,154732.69,{"$f":"ROUND(GelirVergisi(M9)-GelirVergisi(M9-L9),2)","v":3315.7},154732.69,{"$f":"ROUND(GelirVergisi(O9)-GelirVergisi(O9-IF(G9<=0,IF(ISNUMBER(O8),O8,0),IF(ISNUMBER(O8),IF(A9<7,22104.67,22104.67),IF(A9<7,22104.67,22104.67)))),2)","v":3315.7},0,{"$f":"DamgaVergisiMatrahi(G9,A9)","v":0},0,0,22104.67,5396.14,520.11,31921.75,-1300.28,30621.47]
[8,"Normal",0,0,"BRÜT",26005.5,{"$f":"IF($E10=\"NET\",yuvarlama(BrutMaas($B10,$F10,$I10,$J10,$Q10,$S10,150018.75,IF(ISNUMBER($M9),$M9,0))),$F10)","v":26005.5},26005.5,3640.77,260.06,0,22104.67,176837.36,{"$f":"ROUND(GelirVergisi(M10)-GelirVergisi(M10-L10),2)","v":4257.57},176837.36,{"$f":"ROUND(GelirVergisi(O10)-GelirVergisi(O10-IF(G10<=0,IF(ISNUMBER(O9),O9,0),IF(ISNUMBER(O9),IF(A10<7,22104.67,22104.67),IF(A10<7,22104.67,22104.67)))),2)","v":4257.57},0,0,0,0,22104.67,5396.14,520.11,31921.75,-1300.28,30621.47]
{"$rows_left_out":5}
{"sheet":"dikey","index":1,"n_rows":26,"n_cols":14,"rows_kept":26,"cut":false,"hidden":true,"merged":[]}
[]
[null,null,1,2,3,4,5,6,7,8,9,10,11,12]
[null,"SGK Tipi",{"$f":"INDEX(yatay!$B$3:$Z$14,MATCH(C$2,yatay!$A$3:$A$14,0),MATCH($B3,yatay!$B$2:$Z$2,0))","v":"Normal"},{"$f":"INDEX(yatay!$B$3:$Z$14,MATCH(D$2,yatay!$A$3:$A$14,0),MATCH($B3,yatay!$B$2:$Z$2,0))","v":"Normal"},{"$f":"INDEX(yatay!$B$3:$Z$14,MATCH(E$2,yatay!$A$3:$A$14,0),MATCH($B3,yatay!$B$2:$Z$2,0))","v":"Normal"},{"$f":"INDEX(yatay!$B$3:$Z$14,MATCH(F$2,yatay!$A$3:$A$14,0),MATCH($B3,yatay!$B$2:$Z$2,0))","v":"Normal"},{"$f":"INDEX(yatay!$B$3:$Z$14,MATCH(G$2,yatay!$A$3:$A$14,0),MATCH($B3,yatay!$B$2:$Z$2,0))","v":"Normal"},{"$f":"INDEX(yatay!$B$3:$Z$14,MATCH(H$2,yatay!$A$3:$A$14,0),MATCH($B3,yatay!$B$2:$Z$2,0))","v":"Normal"},{"$f":"INDEX(yatay!$B$3:$Z$14,MATCH(I$2,yatay!$A$3:$A$14,0),MATCH($B3,yatay!$B$2:$Z$2,0))","v":"Normal"},{"$f":"INDEX(yatay!$B$3:$Z$14,MATCH(J$2,yatay!$A$3:$A$14,0),MATCH($B3,yatay!$B$2:$Z$2,0))","v":"Normal"},{"$f":"INDEX(yatay!$B$3:$Z$14,MATCH(K$2,yatay!$A$3:$A$14,0),MATCH($B3,yatay!$B$2:$Z$2,0))","v":"Normal"},{"$f":"INDEX(yatay!$B$3:$Z$14,MATCH(L$2,yatay!$A$3:$A$14,0),MATCH($B3,yatay!$B$2:$Z$2,0))","v":"Normal"},{"$f":"INDEX(yatay!$B$3:$Z$14,MATCH(M$2,yatay!$A$3:$A$14,0),MATCH($B3,yatay!$B$2:$Z$2,0))","v":"Normal"},{"$f":"INDEX(yatay!$B$3:$Z$14,MATCH(N$2,yatay!$A$3:$A$14,0),MATCH($B3,yatay!$B$2:$Z$2,0))","v":"Normal"}]
[null,"Engel Derece",{"$f":"INDEX(yatay!$B$3:$Z$14,MATCH(C$2,yatay!$A$3:$A$14,0),MATCH($B4,yatay!$B$2:$Z$2,0))","v":0},{"$f":"INDEX(yatay!$B$3:$Z$14,MATCH(D$2,yatay!$A$3:$A$14,0),MATCH($B4,yatay!$B$2:$Z$2,0))","v":0},{"$f":"INDEX(yatay!$B$3:$Z$14,MATCH(E$2,yatay!$A$3:$A$14,0),MATCH($B4,yatay!$B$2:$Z$2,0))","v":0},{"$f":"INDEX(yatay!$B$3:$Z$14,MATCH(F$2,yatay!$A$3:$A$14,0),MATCH($B4,yatay!$B$2:$Z$2,0))","v":0},{"$f":"INDEX(yatay!$B$3:$Z$14,MATCH(G$2,yatay!$A$3:$A$14,0),MATCH($B4,yatay!$B$2:$Z$2,0))","v":0},{"$f":"INDEX(yatay!$B$3:$Z$14,MATCH(H$2,yatay!$A$3:$A$14,0),MATCH($B4,yatay!$B$2:$Z$2,0))","v":0},{"$f":"INDEX(yatay!$B$3:$Z$14,MATCH(I$2,yatay!$A$3:$A$14,0),MATCH($B4,yatay!$B$2:$Z$2,0))","v":0},{"$f":"INDEX(yatay!$B$3:$Z$14,MATCH(J$2,yatay!$A$3:$A$14,0),MATCH($B4,yatay!$B$2:$Z$2,0))","v":0},{"$f":"INDEX(yatay!$B$3:$Z$14,MATCH(K$2,yatay!$A$3:$A$14,0),MATCH($B4,yatay!$B$2:$Z$2,0))","v":0},{"$f":"INDEX(yatay!$B$3:$Z$14,MATCH(L$2,yatay!$A$3:$A$14,0),MATCH($B4,yatay!$B$2:$Z$2,0))","v":0},{"$f":"INDEX(yatay!$B$3:$Z$14,MATCH(M$2,yatay!$A$3:$A$14,0),MATCH($B4,yatay!$B$2:$Z$2,0))","v":0},{"$f":"INDEX(yatay!$B$3:$Z$14,MATCH(N$2,yatay!$A$3:$A$14,0),MATCH($B4,yatay!$B$2:$Z$2,0))","v":0}]
[null,"Zorunlu Bes",{"$f":"INDEX(yatay!$B$3:$Z$14,MATCH(C$2,yatay!$A$3:$A$14,0),MATCH($B5,yatay!$B$2:$Z$2,0))","v":0},{"$f":"INDEX(yatay!$B$3:$Z$14,MATCH(D$2,yatay!$A$3:$A$14,0),MATCH($B5,yatay!$B$2:$Z$2,0))","v":0},{"$f":"INDEX(yatay!$B$3:$Z$14,MATCH(E$2,yatay!$A$3:$A$14,0),MATCH($B5,yatay!$B$2:$Z$2,0))","v":0},{"$f":"INDEX(yatay!$B$3:$Z$14,MATCH(F$2,yatay!$A$3:$A$14,0),MATCH($B5,yatay!$B$2:$Z$2,0))","v":0},{"$f":"INDEX(yatay!$B$3:$Z$14,MATCH(G$2,yatay!$A$3:$A$14,0),MATCH($B5,yatay!$B$2:$Z$2,0))","v":0},{"$f":"INDEX(yatay!$B$3:$Z$14,MATCH(H$2,yatay!$A$3:$A$14,0),MATCH($B5,yatay!$B$2:$Z$2,0))","v":0},{"$f":"INDEX(yatay!$B$3:$Z$14,MATCH(I$2,yatay!$A$3:$A$14,0),MATCH($B5,yatay!$B$2:$Z$2,0))","v":0},{"$f":"INDEX(yatay!$B$3:$Z$14,MATCH(J$2,yatay!$A$3:$A$14,0),MATCH($B5,yatay!$B$2:$Z$2,0))","v":0},{"$f":"INDEX(yatay!$B$3:$Z$14,MATCH(K$2,yatay!$A$3:$A$14,0),MATCH($B5,yatay!$B$2:$Z$2,0))","v":0},{"$f":"INDEX(yatay!$B$3:$Z$14,MATCH(L$2,yatay!$A$3:$A$14,0),MATCH($B5,yatay!$B$2:$Z$2,0))","v":0},{"$f":"INDEX(yatay!$B$3:$Z$14,MATCH(M$2,yatay!$A$3:$A$14,0),MATCH($B5,yatay!$B$2:$Z$2,0))","v":0},{"$f":"INDEX(yatay!$B$3:$Z$14,MATCH(N$2,yatay!$A$3:$A$14,0),MATCH($B5,yatay!$B$2:$Z$2,0))","v":0}]
[null,"Maaş Tipi",{"$f":"INDEX(yatay!$B$3:$Z$14,MATCH(C$2,yatay!$A$3:$A$14,0),MATCH($B6,yatay!$B$2:$Z$2,0))","v":"BRÜT"},{"$f":"INDEX(yatay!$B$3:$Z$14,MATCH(D$2,yatay!$A$3:$A$14,0),MATCH($B6,yatay!$B$2:$Z$2,0))","v":"BRÜT"},{"$f":"INDEX(yatay!$B$3:$Z$14,MATCH(E$2,yatay!$A$3:$A$14,0),MATCH($B6,yatay!$B$2:$Z$2,0))","v":"BRÜT"},{"$f":"INDEX(yatay!$B$3:$Z$14,MATCH(F$2,yatay!$A$3:$A$14,0),MATCH($B6,yatay!$B$2:$Z$2,0))","v":"BRÜT"},{"$f":"INDEX(yatay!$B$3:$Z$14,MATCH(G$2,yatay!$A$3:$A$14,0),MATCH($B6,yatay!$B$2:$Z$2,0))","v":"BRÜT"},{"$f":"INDEX(yatay!$B$3:$Z$14,MATCH(H$2,yatay!$A$3:$A$14,0),MATCH($B6,yatay!$B$2:$Z$2,0))","v":"BRÜT"},{"$f":"INDEX(yatay!$B$3:$Z$14,MATCH(I$2,yatay!$A$3:$A$14,0),MATCH($B6,yatay!$B$2:$Z$2,0))","v":"BRÜT"},{"$f":"INDEX(yatay!$B$3:$Z$14,MATCH(J$2,yatay!$A$3:$A$14,0),MATCH($B6,yatay!$B$2:$Z$2,0))","v":"BRÜT"},{"$f":"INDEX(yatay!$B$3:$Z$14,MATCH(K$2,yatay!$A$3:$A$14,0),MATCH($B6,yatay!$B$2:$Z$2,0))","v":"BRÜT"},{"$f":"INDEX(yatay!$B$3:$Z$14,MATCH(L$2,yatay!$A$3:$A$14,0),MATCH($B6,yatay!$B$2:$Z$2,0))","v":"BRÜT"},{"$f":"INDEX(yatay!$B$3:$Z$14,MATCH(M$2,yatay!$A$3:$A$14,0),MATCH($B6,yatay!$B$2:$Z$2,0))","v":"BRÜT"},{"$f":"INDEX(yatay!$B$3:$Z$14,MATCH(N$2,yatay!$A$3:$A$14,0),MATCH($B6,yatay!$B$2:$Z$2,0))","v":"BRÜT"}]
[null,"Maaş",{"$f":"INDEX(yatay!$B$3:$Z$14,MATCH(C$2,yatay!$A$3:$A$14,0),MATCH($B7,yatay!$B$2:$Z$2,0))","v":26005.5},{"$f":"INDEX(yatay!$B$3:$Z$14,MATCH(D$2,yatay!$A$3:$A$14,0),MATCH($B7,yatay!$B$2:$Z$2,0))","v":26005.5},{"$f":"INDEX(yatay!$B$3:$Z$14,MATCH(E$2,yatay!$A$3:$A$14,0),MATCH($B7,yatay!$B$2:$Z$2,0))","v":26005.5},{"$f":"INDEX(yatay!$B$3:$Z$14,MATCH(F$2,yatay!$A$3:$A$14,0),MATCH($B7,yatay!$B$2:$Z$2,0))","v":26005.5},{"$f":"INDEX(yatay!$B$3:$Z$14,MATCH(G$2,yatay!$A$3:$A$14,0),MATCH($B7,yatay!$B$2:$Z$2,0))","v":26005.5},{"$f":"INDEX(yatay!$B$3:$Z$14,MATCH(H$2,yatay!$A$3:$A$14,0),MATCH($B7,yatay!$B$2:$Z$2,0))","v":26005.5},{"$f":"INDEX(yatay!$B$3:$Z$14,MATCH(I$2,yatay!$A$3:$A$14,0),MATCH($B7,yatay!$B$2:$Z$2,0))","v":26005.5},{"$f":"INDEX(yatay!$B$3:$Z$14,MATCH(J$2,yatay!$A$3:$A$14,0),MATCH($B7,yatay!$B$2:$Z$2,0))","v":26005.5},{"$f":"INDEX(yatay!$B$3:$Z$14,MATCH(K$2,yatay!$A$3:$A$14,0),MATCH($B7,yatay!$B$2:$Z$2,0))","v":26005.5},{"$f":"INDEX(yatay!$B$3:$Z$14,MATCH(L$2,yatay!$A$3:$A$14,0),MATCH($B7,yatay!$B$2:$Z$2,0))","v":26005.5},{"$f":"INDEX(yatay!$B$3:$Z$14,MATCH(M$2,yatay!$A$3:$A$14,0),MATCH($B7,yatay!$B$2:$Z$2,0))","v":26005.5},{"$f":"INDEX(yatay!$B$3:$Z$14,MATCH(N$2,yatay!$A$3:$A$14,0),MATCH($B7,yatay!$B$2:$Z$2,0))","v":26005.5}]
[null,"Brüt Maaş",{"$f":"INDEX(yatay!$B$3:$Z$14,MATCH(C$2,yatay!$A$3:$A$14,0),MATCH($B8,yatay!$B$2:$Z$2,0))","v":26005.5},{"$f":"INDEX(yatay!$B$3:$Z$14,MATCH(D$2,yatay!$A$3:$A$14,0),MATCH($B8,yatay!$B$2:$Z$2,0))","v":26005.5},{"$f":"INDEX(yatay!$B$3:$Z$14,MATCH(E$2,yatay!$A$3:$A$14,0),MATCH($B8,yatay!$B$2:$Z$2,0))","v":26005.5},{"$f":"INDEX(yatay!$B$3:$Z$14,MATCH(F$2,yatay!$A$3:$A$14,0),MATCH($B8,yatay!$B$2:$Z$2,0))","v":26005.5},{"$f":"INDEX(yatay!$B$3:$Z$14,MATCH(G$2,yatay!$A$3:$A$14,0),MATCH($B8,yatay!$B$2:$Z$2,0))","v":26005.5},{"$f":"INDEX(yatay!$B$3:$Z$14,MATCH(H$2,yatay!$A$3:$A$14,0),MATCH($B8,yatay!$B$2:$Z$2,0))","v":26005.5},{"$f":"INDEX(yatay!$B$3:$Z$14,MATCH(I$2,yatay!$A$3:$A$14,0),MATCH($B8,yatay!$B$2:$Z$2,0))","v":26005.5},{"$f":"INDEX(yatay!$B$3:$Z$14,MATCH(J$2,yatay!$A$3:$A$14,0),MATCH($B8,yatay!$B$2:$Z$2,0))","v":26005.5},{"$f":"INDEX(yatay!$B$3:$Z$14,MATCH(K$2,yatay!$A$3:$A$14,0),MATCH($B8,yatay!$B$2:$Z$2,0))","v":26005.5},{"$f":"INDEX(yatay!$B$3:$Z$14,MATCH(L$2,yatay!$A$3:$A$14,0),MATCH($B8,yatay!$B$2:$Z$2,0))","v":26005.5},{"$f":"INDEX(yatay!$B$3:$Z$14,MATCH(M$2,yatay!$A$3:$A$14,0),MATCH($B8,yatay!$B$2:$Z$2,0))","v":26005.5},{"$f":"INDEX(yatay!$B$3:$Z$14,MATCH(N$2,yatay!$A$3:$A$14,0),MATCH($B8,yatay!$B$2:$Z$2,0))","v":26005.5}]
[null,"SGK Matrahı",{"$f":"INDEX(yatay!$B$3:$Z$14,MATCH(C$2,yatay!$A$3:$A$14,0),MATCH($B9,yatay!$B$2:$Z$2,0))","v":26005.5},{"$f":"INDEX(yatay!$B$3:$Z$14,MATCH(D$2,yatay!$A$3:$A$14,0),MATCH($B9,yatay!$B$2:$Z$2,0))","v":26005.5},{"$f":"INDEX(yatay!$B$3:$Z$14,MATCH(E$2,yatay!$A$3:$A$14,0),MATCH($B9,yatay!$B$2:$Z$2,0))","v":26005.5},{"$f":"INDEX(yatay!$B$3:$Z$14,MATCH(F$2,yatay!$A$3:$A$14,0),MATCH($B9,yatay!$B$2:$Z$2,0))","v":26005.5},{"$f":"INDEX(yatay!$B$3:$Z$14,MATCH(G$2,yatay!$A$3:$A$14,0),MATCH($B9,yatay!$B$2:$Z$2,0))","v":26005.5},{"$f":"INDEX(yatay!$B$3:$Z$14,MATCH(H$2,yatay!$A$3:$A$14,0),MATCH($B9,yatay!$B$2:$Z$2,0))","v":26005.5},{"$f":"INDEX(yatay!$B$3:$Z$14,MATCH(I$2,yatay!$A$3:$A$14,0),MATCH($B9,yatay!$B$2:$Z$2,0))","v":26005.5},{"$f":"INDEX(yatay!$B$3:$Z$14,MATCH(J$2,yatay!$A$3:$A$14,0),MATCH($B9,yatay!$B$2:$Z$2,0))","v":26005.5},{"$f":"INDEX(yatay!$B$3:$Z$14,MATCH(K$2,yatay!$A$3:$A$14,0),MATCH($B9,yatay!$B$2:$Z$2,0))","v":26005.5},{"$f":"INDEX(yatay!$B$3:$Z$14,MATCH(L$2,yatay!$A$3:$A$14,0),MATCH($B9,yatay!$B$2:$Z$2,0))","v":26005.5},{"$f":"INDEX(yatay!$B$3:$Z$14,MATCH(M$2,yatay!$A$3:$A$14,0),MATCH($B9,yatay!$B$2:$Z$2,0))","v":26005.5},{"$f":"INDEX(yatay!$B$3:$Z$14,MATCH(N$2,yatay!$A$3:$A$14,0),MATCH($B9,yatay!$B$2:$Z$2,0))","v":26005.5}]
[null,"SGK Primi",{"$f":"INDEX(yatay!$B$3:$Z$14,MATCH(C$2,yatay!$A$3:$A$14,0),MATCH($B10,yatay!$B$2:$Z$2,0))","v":3640.77},{"$f":"INDEX(yatay!$B$3:$Z$14,MATCH(D$2,yatay!$A$3:$A$14,0),MATCH($B10,yatay!$B$2:$Z$2,0))","v":3640.77},{"$f":"INDEX(yatay!$B$3:$Z$14,MATCH(E$2,yatay!$A$3:$A$14,0),MATCH($B10,yatay!$B$2:$Z$2,0))","v":3640.77},{"$f":"INDEX(yatay!$B$3:$Z$14,MATCH(F$2,yatay!$A$3:$A$14,0),MATCH($B10,yatay!$B$2:$Z$2,0))","v":3640.77},{"$f":"INDEX(yatay!$B$3:$Z$14,MATCH(G$2,yatay!$A$3:$A$14,0),MATCH($B10,yatay!$B$2:$Z$2,0))","v":3640.77},{"$f":"INDEX(yatay!$B$3:$Z$14,MATCH(H$2,yatay!$A$3:$A$14,0),MATCH($B10,yatay!$B$2:$Z$2,0))","v":3640.77},{"$f":"INDEX(yatay!$B$3:$Z$14,MATCH(I$2,yatay!$A$3:$A$14,0),MATCH($B10,yatay!$B$2:$Z$2,0))","v":3640.77},{"$f":"INDEX(yatay!$B$3:$Z$14,MATCH(J$2,yatay!$A$3:$A$14,0),MATCH($B10,yatay!$B$2:$Z$2,0))","v":3640.77},{"$f":"INDEX(yatay!$B$3:$Z$14,MATCH(K$2,yatay!$A$3:$A$14,0),MATCH($B10,yatay!$B$2:$Z$2,0))","v":3640.77},{"$f":"INDEX(yatay!$B$3:$Z$14,MATCH(L$2,yatay!$A$3:$A$14,0),MATCH($B10,yatay!$B$2:$Z$2,0))","v":3640.77},{"$f":"INDEX(yatay!$B$3:$Z$14,MATCH(M$2,yatay!$A$3:$A$14,0),MATCH($B10,yatay!$B$2:$Z$2,0))","v":3640.77},{"$f":"INDEX(yatay!$B$3:$Z$14,MATCH(N$2,yatay!$A$3:$A$14,0),MATCH($B10,yatay!$B$2:$Z$2,0))","v":3640.77}]
{"$rows_left_out":17}
{"sheet":"Makrolar_Etkinleşmemiş","index":2,"n_rows":6,"n_cols":2,"rows_kept":6,"cut":false,"hidden":false,"merged":[[1,1,1,12],[5,1,13,12]]}
[]
[null,"Üzgünüz, kullanmak için makroları etkinleştirmelisiniz."]
[]
[null,"1. Çalışma kitabını açtığınızda Makroları Etkinleştir düğmesini tıklamanız gerekir."]
[]
[null,"2. Bir uyarı görmüyorsanız, \n\n    2.1. Dosya sekmesine tıklayın.\n    2.2. Seçenekleri tıklayın.\n    2.3. Açılan Penceren \"Güven Merkezi\" tıklayın.\n    2.4. Güven Merkezinin sağ kısmındaki \"Güven Merkezi Ayarları\" tıklayın.\n    2.5. Açılan pencerede \"Makro Ayarları\" seçeneğinin sağ kısmındaki \"Bildirimde bulunarak VBA makrolarını devre dışı bırak\" seçin."]